{"text_format":"1","workbook":"xlsx","n_sheets":7,"sheets":["Instructions","Main","A","Error","Calculation Sheet","Sheet2","Sheet3"],"not_rendered":{"charts":0,"images":0,"macros":1,"external_links":0,"defined_names":2,"comments":0,"pivot_tables":0},"unopened":[],"bounds":{"document_bytes":16777216,"sheet_cells":100000,"rows_first":2000,"rows_last":500,"rows_between":2000,"halvings":0,"cell_chars":16384,"cell_head_chars":4096},"cells_cut":0,"cells_raw":0,"read":"whole","date_system":"1900"}

{"sheet":"Instructions","index":0,"n_rows":30,"n_cols":14,"rows_kept":30,"cut":false,"hidden":false,"merged":[[14,2,14,13],[23,2,23,13],[6,3,6,12],[3,2,3,12],[1,4,1,10],[7,3,7,12],[8,3,8,12],[9,3,9,12],[5,2,5,12],[10,2,10,12]]}
[]
[null,null,null,null,"COMPATIBLE WITH MS Excel 2010 & above"]
[]
[null,null,"This Worksheet is purely estimate. New Basic Pay  estimation is based on the MOU signed by the Unions with IBA"]
[]
[null,null,"Steps"]
{"$rows_left_out":25}
{"sheet":"Main","index":1,"n_rows":44,"n_cols":31,"rows_kept":44,"cut":false,"hidden":false,"merged":[[4,27,5,27],[4,28,5,28],[4,29,5,29],[4,30,5,30],[4,24,5,24],[4,25,5,25],[4,26,5,26],[0,13,0,14],[1,0,1,2],[1,13,1,14],[2,0,2,1],[0,3,0,7],[0,9,0,10],[6,14,6,15],[5,14,5,15],[4,14,4,15],[7,14,7,15],[8,14,8,15],[9,14,9,15],[10,14,10,15],[11,14,11,15],[12,14,12,15],[13,14,13,15],[14,14,14,15],[15,14,15,15],[16,14,16,15],[17,14,17,15],[18,14,18,15],[19,14,19,15],[20,14,20,15],[21,14,21,15],[22,14,22,15],[23,14,23,15],[24,14,24,15],[25,14,25,15],[26,14,26,15],[27,14,27,15],[28,14,28,15],[29,14,29,15],[30,14,30,15],[31,14,31,15],[32,14,32,15],[33,14,33,15],[34,14,34,15],[35,14,35,15],[36,14,36,15],[37,14,37,15],[38,14,38,15],[39,14,39,15],[40,14,40,15],[41,14,41,15],[42,14,42,15],[43,14,43,15]]}
["** 1.0/0103215**",null,"Name","Suri",null,null,null,null,"Code",null,null,null,null,"Instructions Sheet"]
[" Arrear from",null,null,"Nov. 12","Till","Feb.15",null,null,null,null,null,null,null,"Arrear Sheet"]
["Pension /PF/NPS",null,"Pension",null,"COMPATIBLE WITH MS Excel 2010 & above"]
[]
[null,null,"Without","OLD","OLD","NEW","OLD","OLD","OLD","OLD ","OLD","FPP","OLD","OLD","OLD",null,"OLD",null,null,null,null,null,null,null,"from","to","tot","New HRA","New CCA cat","New CCA %","New CCA Max"]
["Period","Cadre","Pay","Basic Pay","HRA Category"," HRA CAT.","Capital Cost","HRA %","CCA Cat.","CCA Max.","CCA %","Cadre","FPP","Grad./PQP","Special Allowance",null,"Allowance"]
{"$rows_left_out":39}
{"sheet":"A","index":2,"n_rows":186,"n_cols":27,"rows_kept":186,"cut":false,"hidden":true,"merged":[[0,24,0,26],[0,3,0,5],[0,0,0,2],[0,9,0,11],[0,6,0,8],[0,12,0,14],[0,15,0,17],[0,18,0,20],[0,21,0,23],[58,0,58,11],[67,0,67,11],[59,13,59,14],[137,1,137,12],[139,1,139,4],[139,5,139,8],[139,9,139,12],[120,1,120,12],[127,1,127,12],[77,1,77,3],[137,13,154,13],[159,1,159,6],[160,1,160,2],[160,3,160,4],[160,5,160,6],[175,1,175,7],[174,1,174,14],[175,8,175,14],[176,1,176,5],[176,8,176,12],[177,1,177,5],[177,8,177,12],[178,1,178,5],[178,8,178,12],[179,1,179,5],[179,8,179,12],[180,1,180,5],[180,8,180,12],[184,1,184,5],[184,8,184,12],[181,1,181,5],[181,8,181,12],[182,1,182,5],[182,8,182,12],[183,1,183,5],[183,8,183,12],[185,1,185,5],[185,8,185,12],[186,1,186,5],[186,8,186,12],[187,1,187,5],[187,8,187,12]]}
["Sub Stf",null,null,"Clerk",null,null,"O-I",null,null,"O-II",null,null,"O-III",null,null,"O-IV",null,null,"O-V",null,null,"O-VI",null,null,"O-VII"]
[null,0]
[null,"Old","New",null,"Old","New",null,"OLD","NEW",null,"OLD","NEW",null,"OLD","NEW",null,"OLD","NEW",null,"OLD","NEW",null,"OLD","NEW",null,"OLD","NEW"]
["Basic Pay",5850,{"$f":"ROUND(B4+B4*60.15/100+(B4+B4*63/100)*2/100,0)","v":9559},null,7200,{"$f":"ROUND(E4+E4*60.15/100+(E4+E4*63/100)*2/100,0)","v":11766},null,14500,{"$f":"ROUND(H4+H4*60.15/100+(H4+H4*63/100)*2/100,0)","v":23694},null,19400,{"$f":"ROUND(K4+K4*60.15/100+(K4+K4*63/100)*2/100,0)","v":31702},null,25700,{"$f":"ROUND(N4+N4*60.15/100+(N4+N4*63/100)*2/100,0)","v":41996},null,30600,{"$f":"ROUND(Q4+Q4*60.15/100+(Q4+Q4*63/100)*2/100,0)","v":50003},null,36200,{"$f":"ROUND(T4+T4*60.15/100+(T4+T4*63/100)*2/100,0)","v":59154},null,42000,{"$f":"ROUND(W4+W4*60.15/100+(W4+W4*63/100)*2/100,0)","v":68632},null,46800,{"$f":"ROUND(Z4+Z4*60.15/100+(Z4+Z4*63/100)*2/100,0)","v":76476}]
["HRA",6050,{"$f":"ROUND(B5+B5*60.15/100+(B5+B5*63/100)*2/100,0)","v":9886},null,7600,12419,null,{"$f":"+H4+600","v":15100},24675,null,{"$f":"+K4+700","v":20100},32845,null,{"$f":"+N4+800","v":26500},43304,null,{"$f":"+Q4+900","v":31500},51474,null,{"$f":"+T4+1000","v":37200},60789,null,{"$f":"+W4+1200","v":43200},70593,null,{"$f":"+Z4+1300","v":48100},78600]
["Capital Cost",6250,10213,null,8000,13073,null,15700,25655,null,{"$f":"+K5+800","v":20900},34153,null,{"$f":"+N5+800","v":27300},44611,null,{"$f":"+Q5+900","v":32400},52945,null,{"$f":"+T5+1000","v":38200},62423,null,{"$f":"+W5+1200","v":44400},72554,null,{"$f":"+Z5+1300","v":49400},80725]
{"$rows_left_out":181}
{"sheet":"Error","index":3,"n_rows":42,"n_cols":8,"rows_kept":42,"cut":false,"hidden":true,"merged":[]}
[]
[]
[]
["Period","BP Selection","OLD HRA","OLD Cap. Cost","OLD CCA Cat.","OLD FPP","old pqp","OLD spl All"]
["Nov. 12",{"$f":"IFERROR(IF(Main!B7=\"Clerk\",VLOOKUP(Main!D7,A!$E$4:$F$30,1,FALSE),IF(Main!B7=\"S.Staff\",VLOOKUP(Main!D7,A!$B$4:$C$31,1,FALSE), IF(Main!B7=\"O-I\",VLOOKUP(Main!D7,A!$H$4:$I$27,1,FALSE),IF(Main!B7=\"O-II\",VLOOKUP(Main!D7,A!$K$4:$L$22,1,FALSE),IF(Main!B7=\"O-III\",VLOOKUP(Main!D7,A!$N$4:$O$15,1,FALSE),IF(Main!B7=\"O-IV\",VLOOKUP(Main!D7,A!$Q$4:$R$10,1,FALSE),IF(Main!B7=\"O-V\",VLOOKUP(Main!D7,A!$T$4:$U$8,1,FALSE),IF(Main!B7=\"O-VI\",VLOOKUP(Main!D7,A!$W$4:$X$8,1,FALSE),VLOOKUP(Main!D7,A!$Z$4:$AA$8,1,FALSE))))))))),\"error\")","v":7200},{"$f":"IFERROR(IF(Main!B7=\"Clerk\",VLOOKUP(Main!E7,A!$A$61:$B$65,1,FALSE),IF(Main!B7=\"S.Staff\",VLOOKUP(Main!E7,A!$E$61:$F$65,1,FALSE), VLOOKUP(Main!E7,A!$I$61:$J$65,1,FALSE))),\"error\")","v":"Pop.> 45 lac"},{"$f":"IFERROR(IF(Main!B7=\"Clerk\",\"N.A.\",IF(Main!B7=\"S.Staff\",\"N.A.\", VLOOKUP(Main!G7,A!$N$63:$O$64,1,FALSE))),\"error\")","v":"N.A."},{"$f":"IFERROR(IF(Main!B7=\"Clerk\",\"N.A.\",IF(Main!B7=\"S.Staff\",\"N.A.\", VLOOKUP(Main!I7,A!$J$124:$K$126,1,FALSE))),\"error\")","v":"N.A."},{"$f":"IFERROR(IF(Main!L7=\"N.A.\",A!$B$2,IF(Main!L7=\"S.Staff\",VLOOKUP(Main!M7,A!$B$38:$C$42,1,FALSE),IF(Main!L7=\"Clerk\",VLOOKUP(Main!M7,A!$E$38:$F$42,1,FALSE),IF(Main!L7=\"O-I\",VLOOKUP(Main!M7,A!$H$38:$I$44,1,FALSE),IF(Main!L7=\"O-IV\",VLOOKUP(Main!M7,A!$Q$38:$R$44,1,FALSE),IF(Main!L7=\"O-V\",VLOOKUP(Main!M7,A!$T$38:$U$44,1,FALSE),IF(Main!L7=\"O-VI\",VLOOKUP(Main!M7,A!$W$38:$X$44,1,FALSE),IF(Main!L7=\"O-VII\",VLOOKUP(Main!M7,A!$Z$38:$AA$44,1,FALSE),VLOOKUP(Main!M7,A!$M$38:$N$44,1,FALSE))))))))),\"Error\")","v":0},{"$f":"IFERROR(IF(Main!B7=\"S.Staff\",A!$B$2,IF(Main!B7=\"Clerk\",VLOOKUP(Main!N7,A!$B$163:$C$168,1,FALSE),VLOOKUP(Main!N7,A!$F$163:$G$165,1,FALSE))),\"error\")","v":0},{"$f":"IFERROR(IF(Main!B7=\"S.Staff\",VLOOKUP(Main!O7,A!$I$178:$J$186,1,FALSE),IF(Main!B7=\"Clerk\",VLOOKUP(Main!O7,A!$B$178:$C$181,1,FALSE),VLOOKUP(Main!O6,A!$B$2:'A'!$C$2,1,FALSE))),\"Error\")","v":"No Spl. Allowance"}]
["Dec.12",{"$f":"IFERROR(IF(Main!B8=\"Clerk\",VLOOKUP(Main!D8,A!$E$4:$F$30,1,FALSE),IF(Main!B8=\"S.Staff\",VLOOKUP(Main!D8,A!$B$4:$C$31,1,FALSE), IF(Main!B8=\"O-I\",VLOOKUP(Main!D8,A!$H$4:$I$27,1,FALSE),IF(Main!B8=\"O-II\",VLOOKUP(Main!D8,A!$K$4:$L$22,1,FALSE),IF(Main!B8=\"O-III\",VLOOKUP(Main!D8,A!$N$4:$O$15,1,FALSE),IF(Main!B8=\"O-IV\",VLOOKUP(Main!D8,A!$Q$4:$R$10,1,FALSE),IF(Main!B8=\"O-V\",VLOOKUP(Main!D8,A!$T$4:$U$8,1,FALSE),IF(Main!B8=\"O-VI\",VLOOKUP(Main!D8,A!$W$4:$X$8,1,FALSE),VLOOKUP(Main!D8,A!$Z$4:$AA$8,1,FALSE))))))))),\"error\")","v":7200},{"$f":"IFERROR(IF(Main!B8=\"Clerk\",VLOOKUP(Main!E8,A!$A$61:$B$65,1,FALSE),IF(Main!B8=\"S.Staff\",VLOOKUP(Main!E8,A!$E$61:$F$65,1,FALSE), VLOOKUP(Main!E8,A!$I$61:$J$65,1,FALSE))),\"error\")","v":"Pop.> 45 lac"},{"$f":"IFERROR(IF(Main!B8=\"Clerk\",\"N.A.\",IF(Main!B8=\"S.Staff\",\"N.A.\", VLOOKUP(Main!G8,A!$N$63:$O$64,1,FALSE))),\"error\")","v":"N.A."},{"$f":"IFERROR(IF(Main!B8=\"Clerk\",\"N.A.\",IF(Main!B8=\"S.Staff\",\"N.A.\", VLOOKUP(Main!I8,A!$J$124:$K$126,1,FALSE))),\"error\")","v":"N.A."},{"$f":"IFERROR(IF(Main!L8=\"N.A.\",A!$B$2,IF(Main!L8=\"S.Staff\",VLOOKUP(Main!M8,A!$B$38:$C$42,1,FALSE),IF(Main!L8=\"Clerk\",VLOOKUP(Main!M8,A!$E$38:$F$42,1,FALSE),IF(Main!L8=\"O-I\",VLOOKUP(Main!M8,A!$H$38:$I$44,1,FALSE),IF(Main!L8=\"O-IV\",VLOOKUP(Main!M8,A!$Q$38:$R$44,1,FALSE),IF(Main!L8=\"O-V\",VLOOKUP(Main!M8,A!$T$38:$U$44,1,FALSE),IF(Main!L8=\"O-VI\",VLOOKUP(Main!M8,A!$W$38:$X$44,1,FALSE),IF(Main!L8=\"O-VII\",VLOOKUP(Main!M8,A!$Z$38:$AA$44,1,FALSE),VLOOKUP(Main!M8,A!$M$38:$N$44,1,FALSE))))))))),\"Error\")","v":0},{"$f":"IFERROR(IF(Main!B8=\"S.Staff\",A!$B$2,IF(Main!B8=\"Clerk\",VLOOKUP(Main!N8,A!$B$163:$C$168,1,FALSE),VLOOKUP(Main!N8,A!$F$163:$G$165,1,FALSE))),\"error\")","v":0},{"$f":"IFERROR(IF(Main!B8=\"S.Staff\",VLOOKUP(Main!O8,A!$I$178:$J$186,1,FALSE),IF(Main!B8=\"Clerk\",VLOOKUP(Main!O8,A!$B$178:$C$181,1,FALSE),VLOOKUP(Main!O7,A!$B$2:'A'!$C$2,1,FALSE))),\"Error\")","v":"No Spl. Allowance"}]
{"$rows_left_out":37}
{"sheet":"Calculation Sheet","index":4,"n_rows":95,"n_cols":28,"rows_kept":95,"cut":false,"hidden":false,"merged":[[48,17,49,17],[48,18,49,18],[1,17,2,17],[91,0,91,1],[92,0,92,1],[55,0,55,1],[68,0,68,1],[81,0,81,1],[1,0,1,16],[48,0,48,16],[8,0,8,1],[21,0,21,1],[34,0,34,1],[44,0,44,1],[45,0,45,1]]}
[{"$f":"+Main!A1","v":"** 1.0/0103215**"},null,{"$f":"+Main!C1","v":"Name"},{"$f":"+Main!D1","v":"Suri"},null,null,null,null,null,null,null,null,null,null,null,null,null,"Page 1 of 2"]
["A. Existing ( as per 9th BPS)",null,null,null,null,null,null,null,null,null,null,null,null,null,null,null,null,"% increase in BP+DA"]
["Period","Desg.","Basic Pay - 1","FPP\n 2","Grd/PQP \n3","Spl. All.\n 4","Other \n 5","D.A. \n 6","HRA \n 7","CCA \n 8","Conv.  \n 9","Wash. \n 10","Bank PF \n 11","Total - 12       (1 to11)","WP Day","WP Amt \n 13","Net\n14",null,null,null,null,null,null,"pf on fpp","from to","no.of days"]
[{"$f":"IF($Y4=1,\" \",Main!A7)","v":"Nov. 12"},{"$f":"IF($Y4=1,\" \",Main!B7)","v":"Clerk"},{"$f":"IF(Y4=1,0,Main!D7)","v":7200},{"$f":"IF(Y4=1,0,Main!M7)","v":0},{"$f":"IF(Y4=1,0,Main!N7)","v":0},{"$f":"IF(Y4=1,0,Main!Q7)","v":0},null,{"$f":"ROUND((C4+E4+F4+G4)*A!D81*A!$D$80,2)","v":5508},{"$f":"ROUND((C4+E4+F4+G4)*Main!H7,2)","v":720},{"$f":"MIN(ROUND(C4*Main!K7,2),Main!J7)","v":0},{"$f":"IF(B4=\"Clerk\",IF(C4>14100,275,225),IF(B4=\"S.Staff\",IF(C4>9100,275,225),0))","v":225},{"$f":"IF(B4=\"S.Staff\",100,0)","v":0},{"$f":"IF(Main!$C$3=\"PF\",ROUND(('Calculation Sheet'!C4+'Calculation Sheet'!X4+'Calculation Sheet'!E4+'Calculation Sheet'!F4+'Calculation Sheet'!G4)*10%,2),IF(Main!$C$3=\"NPS\",ROUND(('Calculation Sheet'!C4+'Calculation Sheet'!X5+'Calculation Sheet'!E4+'Calculation Sheet'!F4+'Calculation Sheet'!G4+'Calculation Sheet'!H4)*12%,0),0))","v":0},{"$f":"SUM(C4:M4)","v":13653},{"$f":"IF(Y4=1,0,Main!C7)","v":0},{"$f":"ROUND(N4*O4/Z4,2)","v":0},{"$f":"+N4-P4","v":13653},{"$f":"IF(N4<>0,((C51+D51+E51+F51+G51+H51)-(C4+D4+E4+F4+G4+H4))/(C4+D4+E4+F4+G4+H4),\"             ---\")","v":2.6793358514321668E-2},null,null,null,null,null,{"$f":"IF(D4<>0,IF(B4=\"Clerk\",A!$E$36,IF(B4=\"S.Staff\",A!$B$36,IF(B4=\"O-I\",A!$H$36,IF(B4=\"O-II\",A!$K$36,IF(B4=\"O-III\",A!$N$36,IF(B4=\"O-IV\",A!$Q$36,IF(B4=\"O-V\",A!$T$36,IF(B4=\"O-VI\",A!$W$36,IF(B4=\"O-VII\",A!$Z$36,))))))))),0)","v":0},{"$f":"+Main!AA7","v":0},30]
[{"$f":"IF($Y5=1,\" \",Main!A8)","v":"Dec.12"},{"$f":"IF(Y5=1,\" \",Main!B8)","v":"Clerk"},{"$f":"IF(Y5=1,0,Main!D8)","v":7200},{"$f":"IF(Y5=1,0,Main!M8)","v":0},{"$f":"IF(Y5=1,0,Main!N8)","v":0},{"$f":"IF(Y5=1,0,Main!Q8)","v":0},null,{"$f":"ROUND((C5+E5+F5+G5)*A!D82*A!$D$80,2)","v":5508},{"$f":"ROUND((C5+E5+F5+G5)*Main!H8,2)","v":720},{"$f":"MIN(ROUND(C5*Main!K8,2),Main!J8)","v":0},{"$f":"IF(B5=\"Clerk\",IF(C5>14100,275,225),IF(B5=\"S.Staff\",IF(C5>9100,275,225),0))","v":225},{"$f":"IF(B5=\"S.Staff\",100,0)","v":0},{"$f":"IF(Main!$C$3=\"PF\",ROUND(('Calculation Sheet'!C5+'Calculation Sheet'!X5+'Calculation Sheet'!E5+'Calculation Sheet'!F5+'Calculation Sheet'!G5)*10%,2),IF(Main!$C$3=\"NPS\",ROUND(('Calculation Sheet'!C5+'Calculation Sheet'!X6+'Calculation Sheet'!E5+'Calculation Sheet'!F5+'Calculation Sheet'!G5+'Calculation Sheet'!H5)*12%,0),0))","v":0},{"$f":"SUM(C5:M5)","v":13653},{"$f":"IF(Y5=1,0,Main!C8)","v":0},{"$f":"ROUND(N5*O5/Z5,2)","v":0},{"$f":"+N5-P5","v":13653},{"$f":"IF(N5<>0,((C52+D52+E52+F52+G52+H52)-(C5+D5+E5+F5+G5+H5))/(C5+D5+E5+F5+G5+H5),\"             ---\")","v":2.6793358514321668E-2},null,null,null,null,null,{"$f":"IF(D5<>0,IF(B5=\"Clerk\",A!$E$36,IF(B5=\"S.Staff\",A!$B$36,IF(B5=\"O-I\",A!$H$36,IF(B5=\"O-II\",A!$K$36,IF(B5=\"O-III\",A!$N$36,IF(B5=\"O-IV\",A!$Q$36,IF(B5=\"O-V\",A!$T$36,IF(B5=\"O-VI\",A!$W$36,IF(B5=\"O-VII\",A!$Z$36,))))))))),0)","v":0},{"$f":"+Main!AA8","v":0},31]
[{"$f":"IF($Y6=1,\" \",Main!A9)","v":"Jan.13"},{"$f":"IF(Y6=1,\" \",Main!B9)","v":"Clerk"},{"$f":"IF(Y6=1,0,Main!D9)","v":7200},{"$f":"IF(Y6=1,0,Main!M9)","v":0},{"$f":"IF(Y6=1,0,Main!N9)","v":0},{"$f":"IF(Y6=1,0,Main!Q9)","v":0},null,{"$f":"ROUND((C6+E6+F6+G6)*A!D83*A!$D$80,2)","v":5508},{"$f":"ROUND((C6+E6+F6+G6)*Main!H9,2)","v":720},{"$f":"MIN(ROUND(C6*Main!K9,2),Main!J9)","v":0},225,0,{"$f":"IF(Main!$C$3=\"PF\",ROUND(('Calculation Sheet'!C6+'Calculation Sheet'!X6+'Calculation Sheet'!E6+'Calculation Sheet'!F6+'Calculation Sheet'!G6)*10%,2),IF(Main!$C$3=\"NPS\",ROUND(('Calculation Sheet'!C6+'Calculation Sheet'!X7+'Calculation Sheet'!E6+'Calculation Sheet'!F6+'Calculation Sheet'!G6+'Calculation Sheet'!H6)*12%,0),0))","v":0},13653,{"$f":"IF(Y6=1,0,Main!C9)","v":0},{"$f":"ROUND(N6*O6/Z6,2)","v":0},13653,2.6793358514321668E-2,null,null,null,null,null,{"$f":"IF(D6<>0,IF(B6=\"Clerk\",A!$E$36,IF(B6=\"S.Staff\",A!$B$36,IF(B6=\"O-I\",A!$H$36,IF(B6=\"O-II\",A!$K$36,IF(B6=\"O-III\",A!$N$36,IF(B6=\"O-IV\",A!$Q$36,IF(B6=\"O-V\",A!$T$36,IF(B6=\"O-VI\",A!$W$36,IF(B6=\"O-VII\",A!$Z$36,))))))))),0)","v":0},{"$f":"+Main!AA9","v":0},31]
{"$rows_left_out":90}
{"sheet":"Sheet2","index":5,"n_rows":142,"n_cols":15,"rows_kept":142,"cut":false,"hidden":true,"merged":[[2,1,2,3],[36,1,36,3],[70,1,70,3],[100,1,100,3],[127,1,127,3]]}
[]
[]
[null,"Sub Stf"]
[null,null,0,null,null,null,"ADDITIONAL",null,null,0]
[null,null,"Old","New",null,{"$f":"401*0.15","v":60.15},63,null,"NEW SCALE","INCREASE","PAY SCALE"]
[null,null,5850,null,{"$f":"ROUND(C6+C6*60.15/100,0)","v":9369},{"$f":"ROUND(C6*$F$5/100,0)","v":3519},{"$f":"ROUND((C6+C6*$G$5/100)*2/100,0)","v":191},null,{"$f":"+E6+G6","v":9560},{"$f":"ROUND(I6*J4/100,0)","v":0},{"$f":"CEILING(+I6+J6,5)","v":9560},null,{"$f":"ROUND((K6-E6)/E6*100,2)","v":2.04},null,{"$f":"ROUND(C6+C6*60.15/100+(C6+C6*63/100)*2/100,0)","v":9559}]
{"$rows_left_out":137}
{"sheet":"Sheet3","index":6,"n_rows":94,"n_cols":40,"rows_kept":94,"cut":false,"hidden":true,"merged":[[1,17,1,27],[1,28,1,29],[1,30,1,31],[1,32,1,33],[1,0,1,16],[8,0,8,1],[21,0,21,1],[34,0,34,1],[44,0,44,1],[45,0,45,1]]}
[{"$f":"+Main!A1","v":"** 1.0/0103215**"},null," ",{"$f":"+Main!D1","v":"Suri"},null,null,null,null,null,null,null,null,null,null,null,"Page 1 of 2",null,null,null,null,null,null,null,null,null,null,null,null,null,null,null,null,null,null,null,null,null,1.5E-3,1.1999999999999999E-3,1E-3]
["BP+DA -  Drawn ",null,null,null,null,null,null,null,null,null,null,null,null,null,null,null,null,"PROPOSED BP+DA (with DA SLAB @ 0.15, 0.12 & 0.10)",null,null,null,null,null,null,null,null,null,null,"SLAB RATE @ 0.15",null,"SLAB RATE @ 0.12",null,"SLAB RATE @ 0.10"]
["Period","Desg.","Basic Pay - 1","FPP\n 2","Grd/PQP \n3","Spl. All.\n 4","Other \n 5","D.A. \n 2","HRA \n 7","CCA \n 8","Conv.  \n 9","Wash. \n 10","Bank PF \n 11","Total - 1+2\n3","WP Day","WP Amt \n 13","Net\n14","Basic Pay - 4","D.A. (SLAB RATE @ 0.15)\n5","D.A. (SLAB RATE @ 0.12)\n 6","D.A. (SLAB RATE @ 0.10)\n 7","Total (4+5)\n8","Total (4+6)\n9","pf on fpp","from to","no.of days",null,"Total (4+7)\n10","Arrear\n(8-3)","% increase","Arrear\n(9-3)","% increase","Arrear\n(10-3)","% increase"]
[{"$f":"IF($Y4=1,\" \",Main!A7)","v":"Nov. 12"},{"$f":"IF($Y4=1,\" \",Main!B7)","v":"Clerk"},{"$f":"IF(Y4=1,0,Main!D7)","v":7200},{"$f":"IF(Y4=1,0,Main!M7)","v":0},{"$f":"IF(Y4=1,0,Main!N7)","v":0},{"$f":"IF(Y4=1,0,Main!Q7)","v":0},null,{"$f":"ROUND((C4+E4+F4+G4)*A!D81*A!$D$80,2)","v":5508},{"$f":"ROUND((C4+E4+F4+G4)*Main!H7,2)","v":720},{"$f":"MIN(ROUND(C4*Main!K7,2),Main!J7)","v":0},{"$f":"IF(B4=\"Clerk\",IF(C4>14100,275,225),IF(B4=\"S.Staff\",IF(C4>9100,275,225),0))","v":225},{"$f":"IF(B4=\"S.Staff\",100,0)","v":0},{"$f":"IF(Main!$C$3=\"PF\",ROUND(('Calculation Sheet'!C4+'Calculation Sheet'!X4+'Calculation Sheet'!E4+'Calculation Sheet'!F4+'Calculation Sheet'!G4)*10%,2),IF(Main!$C$3=\"NPS\",ROUND(('Calculation Sheet'!C4+'Calculation Sheet'!X5+'Calculation Sheet'!E4+'Calculation Sheet'!F4+'Calculation Sheet'!G4+'Calculation Sheet'!H4)*12%,0),0))","v":0},{"$f":"SUM(C4:M4)","v":13653},{"$f":"IF(Y4=1,0,Main!C7)","v":0},{"$f":"ROUND(N4*O4/Z4,2)","v":0},{"$f":"+N4-P4","v":13653},{"$f":"IF(B51=\"S.Staff\",VLOOKUP(C4,A!$B$4:$C$31,2,FALSE),IF(B51=\"Clerk\",VLOOKUP(C4,A!$E$4:$F$30,2,FALSE),IF(B51=\"O-I\",VLOOKUP(C4,A!$H$4:$I$27,2,FALSE),IF(B51=\"O-II\",VLOOKUP(C4,A!$K$4:$L$22,2,FALSE),IF(B51=\"O-III\",VLOOKUP(C4,A!$N$4:$O$15,2,FALSE),IF(B51=\"O-IV\",VLOOKUP(C4,A!$Q$4:$R$10,2,FALSE),IF(B51=\"O-V\",VLOOKUP(C4,A!$T$4:$U$8,2,FALSE),IF(B51=\"O-VI\",VLOOKUP(C4,A!$W$4:$X$8,2,FALSE),IF(B51=\"O-VII\",VLOOKUP(C4,A!$Z$4:$AA$8,2,FALSE),IF(B51=\" \",0,\"Error\"))))))))))","v":11766},{"$f":"ROUND((R4+E51+F51+G51)*A!E81*$AL$1,2)","v":1923.74},{"$f":"ROUND((R4+E51+F51+G51)*A!E81*$AM$1,2)","v":1538.99},{"$f":"ROUND((R4+E51+F51+G51)*A!E81*$AN$1,2)","v":1282.49},{"$f":"+R4+S4","v":13689.74},{"$f":"+R4+T4","v":13304.99},{"$f":"IF(D4<>0,IF(B4=\"Clerk\",A!$E$36,IF(B4=\"S.Staff\",A!$B$36,IF(B4=\"O-I\",A!$H$36,IF(B4=\"O-II\",A!$K$36,IF(B4=\"O-III\",A!$N$36,IF(B4=\"O-IV\",A!$Q$36,IF(B4=\"O-V\",A!$T$36,IF(B4=\"O-VI\",A!$W$36,IF(B4=\"O-VII\",A!$Z$36,))))))))),0)","v":0},{"$f":"+Main!AA7","v":0},30,null,{"$f":"+R4+U4","v":13048.49},{"$f":"+V4-N4","v":36.739999999999782},{"$f":"(AC4/N4)","v":2.6909836665934069E-3},{"$f":"+W4-N4","v":-348.01000000000022},{"$f":"AE4/N4","v":-2.5489635977440871E-2},{"$f":"+AB4-N4","v":-604.51000000000022},{"$f":"AG4/N4","v":-4.4276715740130389E-2}]
[{"$f":"IF($Y5=1,\" \",Main!A8)","v":"Dec.12"},{"$f":"IF(Y5=1,\" \",Main!B8)","v":"Clerk"},{"$f":"IF(Y5=1,0,Main!D8)","v":7200},{"$f":"IF(Y5=1,0,Main!M8)","v":0},{"$f":"IF(Y5=1,0,Main!N8)","v":0},{"$f":"IF(Y5=1,0,Main!Q8)","v":0},null,{"$f":"ROUND((C5+E5+F5+G5)*A!D82*A!$D$80,2)","v":5508},{"$f":"ROUND((C5+E5+F5+G5)*Main!H8,2)","v":720},{"$f":"MIN(ROUND(C5*Main!K8,2),Main!J8)","v":0},{"$f":"IF(B5=\"Clerk\",IF(C5>14100,275,225),IF(B5=\"S.Staff\",IF(C5>9100,275,225),0))","v":225},{"$f":"IF(B5=\"S.Staff\",100,0)","v":0},{"$f":"IF(Main!$C$3=\"PF\",ROUND(('Calculation Sheet'!C5+'Calculation Sheet'!X5+'Calculation Sheet'!E5+'Calculation Sheet'!F5+'Calculation Sheet'!G5)*10%,2),IF(Main!$C$3=\"NPS\",ROUND(('Calculation Sheet'!C5+'Calculation Sheet'!X6+'Calculation Sheet'!E5+'Calculation Sheet'!F5+'Calculation Sheet'!G5+'Calculation Sheet'!H5)*12%,0),0))","v":0},{"$f":"SUM(C5:M5)","v":13653},{"$f":"IF(Y5=1,0,Main!C8)","v":0},{"$f":"ROUND(N5*O5/Z5,2)","v":0},{"$f":"+N5-P5","v":13653},{"$f":"IF(B52=\"S.Staff\",VLOOKUP(C5,A!$B$4:$C$31,2,FALSE),IF(B52=\"Clerk\",VLOOKUP(C5,A!$E$4:$F$30,2,FALSE),IF(B52=\"O-I\",VLOOKUP(C5,A!$H$4:$I$27,2,FALSE),IF(B52=\"O-II\",VLOOKUP(C5,A!$K$4:$L$22,2,FALSE),IF(B52=\"O-III\",VLOOKUP(C5,A!$N$4:$O$15,2,FALSE),IF(B52=\"O-IV\",VLOOKUP(C5,A!$Q$4:$R$10,2,FALSE),IF(B52=\"O-V\",VLOOKUP(C5,A!$T$4:$U$8,2,FALSE),IF(B52=\"O-VI\",VLOOKUP(C5,A!$W$4:$X$8,2,FALSE),IF(B52=\"O-VII\",VLOOKUP(C5,A!$Z$4:$AA$8,2,FALSE),IF(B52=\" \",0,\"Error\"))))))))))","v":11766},{"$f":"ROUND((R5+E52+F52+G52)*A!E82*$AL$1,2)","v":1923.74},{"$f":"ROUND((R5+E52+F52+G52)*A!E82*$AM$1,2)","v":1538.99},{"$f":"ROUND((R5+E52+F52+G52)*A!E82*$AN$1,2)","v":1282.49},{"$f":"+R5+S5","v":13689.74},{"$f":"+R5+T5","v":13304.99},{"$f":"IF(D5<>0,IF(B5=\"Clerk\",A!$E$36,IF(B5=\"S.Staff\",A!$B$36,IF(B5=\"O-I\",A!$H$36,IF(B5=\"O-II\",A!$K$36,IF(B5=\"O-III\",A!$N$36,IF(B5=\"O-IV\",A!$Q$36,IF(B5=\"O-V\",A!$T$36,IF(B5=\"O-VI\",A!$W$36,IF(B5=\"O-VII\",A!$Z$36,))))))))),0)","v":0},{"$f":"+Main!AA8","v":0},30,null,{"$f":"+R5+U5","v":13048.49},{"$f":"+V5-N5","v":36.739999999999782},{"$f":"(AC5/N5)","v":2.6909836665934069E-3},{"$f":"+W5-N5","v":-348.01000000000022},{"$f":"AE5/N5","v":-2.5489635977440871E-2},{"$f":"+AB5-N5","v":-604.51000000000022},{"$f":"AG5/N5","v":-4.4276715740130389E-2}]
[{"$f":"IF($Y6=1,\" \",Main!A9)","v":"Jan.13"},{"$f":"IF(Y6=1,\" \",Main!B9)","v":"Clerk"},{"$f":"IF(Y6=1,0,Main!D9)","v":7200},{"$f":"IF(Y6=1,0,Main!M9)","v":0},{"$f":"IF(Y6=1,0,Main!N9)","v":0},{"$f":"IF(Y6=1,0,Main!Q9)","v":0},null,{"$f":"ROUND((C6+E6+F6+G6)*A!D83*A!$D$80,2)","v":5508},{"$f":"ROUND((C6+E6+F6+G6)*Main!H9,2)","v":720},{"$f":"MIN(ROUND(C6*Main!K9,2),Main!J9)","v":0},225,0,{"$f":"IF(Main!$C$3=\"PF\",ROUND(('Calculation Sheet'!C6+'Calculation Sheet'!X6+'Calculation Sheet'!E6+'Calculation Sheet'!F6+'Calculation Sheet'!G6)*10%,2),IF(Main!$C$3=\"NPS\",ROUND(('Calculation Sheet'!C6+'Calculation Sheet'!X7+'Calculation Sheet'!E6+'Calculation Sheet'!F6+'Calculation Sheet'!G6+'Calculation Sheet'!H6)*12%,0),0))","v":0},13653,{"$f":"IF(Y6=1,0,Main!C9)","v":0},{"$f":"ROUND(N6*O6/Z6,2)","v":0},13653,{"$f":"IF(B53=\"S.Staff\",VLOOKUP(C6,A!$B$4:$C$31,2,FALSE),IF(B53=\"Clerk\",VLOOKUP(C6,A!$E$4:$F$30,2,FALSE),IF(B53=\"O-I\",VLOOKUP(C6,A!$H$4:$I$27,2,FALSE),IF(B53=\"O-II\",VLOOKUP(C6,A!$K$4:$L$22,2,FALSE),IF(B53=\"O-III\",VLOOKUP(C6,A!$N$4:$O$15,2,FALSE),IF(B53=\"O-IV\",VLOOKUP(C6,A!$Q$4:$R$10,2,FALSE),IF(B53=\"O-V\",VLOOKUP(C6,A!$T$4:$U$8,2,FALSE),IF(B53=\"O-VI\",VLOOKUP(C6,A!$W$4:$X$8,2,FALSE),IF(B53=\"O-VII\",VLOOKUP(C6,A!$Z$4:$AA$8,2,FALSE),IF(B53=\" \",0,\"Error\"))))))))))","v":11766},{"$f":"ROUND((R6+E53+F53+G53)*A!E83*$AL$1,2)","v":1923.74},{"$f":"ROUND((R6+E53+F53+G53)*A!E83*$AM$1,2)","v":1538.99},{"$f":"ROUND((R6+E53+F53+G53)*A!E83*$AN$1,2)","v":1282.49},13689.74,13304.99,{"$f":"IF(D6<>0,IF(B6=\"Clerk\",A!$E$36,IF(B6=\"S.Staff\",A!$B$36,IF(B6=\"O-I\",A!$H$36,IF(B6=\"O-II\",A!$K$36,IF(B6=\"O-III\",A!$N$36,IF(B6=\"O-IV\",A!$Q$36,IF(B6=\"O-V\",A!$T$36,IF(B6=\"O-VI\",A!$W$36,IF(B6=\"O-VII\",A!$Z$36,))))))))),0)","v":0},{"$f":"+Main!AA9","v":0},30,null,13048.49,36.739999999999782,2.6909836665934069E-3,{"$f":"+W6-N6","v":-348.01000000000022},-2.5489635977440871E-2,{"$f":"+AB6-N6","v":-604.51000000000022},-4.4276715740130389E-2]
{"$rows_left_out":88}